Reaction Details
TargetSodium- and chloride-dependent GABA transporter 1/GABA transporter 2/GABA transporter 3/betaine transporter
LigandBDBM23183
Substrate/Competitorn/a
Meas. Tech.ChEMBL_177035 (CHEMBL779556)
IC50 320000±n/a nM
Citation Krogsgaard-Larsen, PNielsen, LFalch, ECurtis, DR GABA agonists. Resolution, absolute stereochemistry, and enantioselectivity of (S)-(+)- and (R)-(-)-dihydromuscimol. J Med Chem28:1612-7 (1985) Sodium- and chloride-dependent GABA transporter 1/GABA transporter 2/GABA transporter 3/betaine transporter
Name:Sodium- and chloride-dependent GABA transporter 1/GABA transporter 2/GABA transporter 3/betaine transporter
Synonyms:GABA transporter
Type:n/a
Mol. Mass.:n/a
Description:ASSAY_ID of ChEMBL is 177939
Components:This complex has 4 components.
Component 1
Name:Sodium- and chloride-dependent GABA transporter 3
Type:PROTEIN
Mol. Mass.:69948.77
Organism:Rattus norvegicus
Description:ChEMBL_105007
Residue:627
Component 2
Name:Sodium- and chloride-dependent GABA transporter 2
Synonyms:GABA transporter Gabt2 S6A13_RAT | Slc6a13
Type:PROTEIN
Mol. Mass.:68261.89
Organism:Rattus norvegicus
Description:ChEMBL_70051
Residue:602
Component 3
Name:Sodium- and chloride-dependent GABA transporter 1
Synonyms:GABA transporter Gat-1 SC6A1_RAT Solute carrier family 6 member 1
Type:PROTEIN
Mol. Mass.:67006.26
Organism:Rattus norvegicus
Description:ChEMBL_1472611
Residue:599
Component 4
Name:Sodium- and chloride-dependent betaine transporter
Synonyms:Na(+)/Cl(-) betaine/GABA transporter Slc6a12 Solute carrier family 6 member 12
Type:PROTEIN
Mol. Mass.:69749.57
Organism:Rattus norvegicus
Description:ChEMBL_105007
Residue:614
BDBM23183
NameBDBM23183
Synonyms:5-(aminomethyl)-1,2-oxazol-3-ol CHEMBL273481 Pantherine
TypeGABA Agonist
Emp. Form.C4H6N2O2
Mol. Mass.114.1026
SMILESNCc1cc(=O)[nH]o1