Reaction Details
TargetAdenosine receptor A1
LigandBDBM50021004
Substrate/Competitorn/a
Meas. Tech.ChEBML_29149
Ki 4.6±n/a nM
Citation Daly, JWPadgett, WLShamim, MT Analogues of 1,3-dipropyl-8-phenylxanthine: enhancement of selectivity at A1-adenosine receptors by aryl substituents. J Med Chem29:1520-4 (1986) Adenosine receptor A1
Name:Adenosine receptor A1
Type:Protein
Mol. Mass.:36704.13
Organism:Rattus norvegicus (rat)
Description:n/a
Residue:326
BDBM50021004
NameBDBM50021004
Synonyms:8-(2,4-Diamino-phenyl)-1,3-dipropyl-3,7-dihydro-purine-2,6-dione CHEMBL415971
TypeSmall organic molecule
Emp. Form.C17H22N6O2
Mol. Mass.342.3956
SMILESCCCn1c2nc([nH]c2c(=O)n(CCC)c1=O)-c1ccc(N)cc1N