Reaction Details
TargetMu-type opioid receptor
LigandBDBM50021495
Substrate/Competitorn/a
Meas. Tech.ChEBML_145293
Ki 1.5±n/a nM
Citation Portoghese, PSLarson, DLSayre, LMYim, CBRonsisvalle, GTam, SWTakemori, AE Opioid agonist and antagonist bivalent ligands. The relationship between spacer length and selectivity at multiple opioid receptors. J Med Chem29:1855-61 (1986) Mu-type opioid receptor
Name:Mu-type opioid receptor
Type:Enzyme Catalytic Domain
Mol. Mass.:11165.58
Organism:GUINEA PIG
Description:P97266
Residue:98
BDBM50021495
NameBDBM50021495
Synonyms:1N,4N-di[4-cyclopropylmethyl-10,17-dihydroxy-(13R,14R,17S)-12-oxa-4-azapentacyclo[9.6.1.01,13.05,17.07,18]octadeca-7(18),8,10-trien-14-ylcarbamoylmethylcarbamoylmethyl]succinamide | CHEMBL3350130
TypeSmall organic molecule
Emp. Form.C52H66N8O12
Mol. Mass.995.1268
SMILES[H][C@@]12Oc3c4c(C[C@H]5N(CC6CC6)CC[C@@]14[C@@]5(O)CC[C@H]2NC(=O)CNC(=O)CNC(=O)CCC(=O)NCC(=O)NCC(=O)N[C@@H]1CC[C@@]2(O)[C@H]4Cc5ccc(O)c6O[C@]1([H])[C@]2(CCN4CC1CC1)c56)ccc3O