Reaction Details
TargetThymidylate synthase
LigandBDBM50021751
Substrate/Competitorn/a
Meas. Tech.ChEBML_209133
Ki 2400±n/a nM
Citation Al-Razzak, LASchwepler, DDecedue, CJBalzarini, JDe Clercq, EMertes, MP 5-Quinone derivatives of 2'-deoxyuridine 5'-phosphate: inhibition and inactivation of thymidylate synthase, antitumor cell, and antiviral studies. J Med Chem30:409-19 (1987) Thymidylate synthase
Name:Thymidylate synthase
Type:Enzyme
Mol. Mass.:36576.54
Organism:Lactobacillus casei
Description:n/a
Residue:316
BDBM50021751
NameBDBM50021751
Synonyms:CHEMBL3143106 | Phosphoric acid mono-{5-[5-(1,4-dimethoxy-3-methyl-naphthalen-2-yl)-2,4-dioxo-3,4-dihydro-2H-pyrimidin-1-yl]-3-hydroxy-tetrahydro-furan-2-ylmethyl} ester
TypeSmall organic molecule
Emp. Form.C22H25N2O10P
Mol. Mass.508.4151
SMILESCOc1c(C)c(c(OC)c2ccccc12)-c1cn([C@H]2C[C@H](O)[C@@H](COP(O)(O)=O)O2)c(=O)[nH]c1=O