Reaction Details
TargetBeta-lactamase
LigandBDBM50021959
Substrate/Competitorn/a
Meas. Tech.ChEBML_41049
IC50 80±n/a nM
Citation Micetich, RGMaiti, SNSpevak, PHall, TWYamabe, SIshida, NTanaka, MYamazaki, TNakai, AOgawa, K Synthesis and beta-lactamase inhibitory properties of 2 beta-[(1,2,3-triazol-1-yl)methyl]-2 alpha-methylpenam-3 alpha-carboxylic acid 1,1-dioxide and related triazolyl derivatives. J Med Chem30:1469-74 (1987) Beta-lactamase
Name:Beta-lactamase
Type:PROTEIN
Mol. Mass.:31367.53
Organism:Staphylococcus aureus
Description:ChEMBL_41052
Residue:281
BDBM50021959
NameBDBM50021959
Synonyms:CHEMBL777 US9120808, Clavulanic acid potassium salt clavulanic acid
TypeSmall organic molecule
Emp. Form.C8H9NO5
Mol. Mass.199.1608
SMILESOC\C=C1/O[C@@H]2CC(=O)N2[C@H]1C(O)=O