Reaction Details
TargetBeta-lactamase
LigandBDBM50021954
Substrate/Competitorn/a
Meas. Tech.ChEBML_41049
IC50 6500±n/a nM
Citation Micetich, RGMaiti, SNSpevak, PHall, TWYamabe, SIshida, NTanaka, MYamazaki, TNakai, AOgawa, K Synthesis and beta-lactamase inhibitory properties of 2 beta-[(1,2,3-triazol-1-yl)methyl]-2 alpha-methylpenam-3 alpha-carboxylic acid 1,1-dioxide and related triazolyl derivatives. J Med Chem30:1469-74 (1987) Beta-lactamase
Name:Beta-lactamase
Type:PROTEIN
Mol. Mass.:31367.53
Organism:Staphylococcus aureus
Description:ChEMBL_41052
Residue:281
BDBM50021954
NameBDBM50021954
Synonyms:(2S,5R)-3,3-Dimethyl-4,4,7-trioxo-4lambda*6*-thia-1-aza-bicyclo[3.2.0]heptane-2-carboxylic acid 3,3-Dimethyl-4,4,7-trioxo-4lambda*6*-thia-1-aza-bicyclo[3.2.0]heptane-2-carboxylic acid CHEMBL403 SULBACTAM US20230322715, Compound ALK-09 | US9120808, Sulbactam sodium salt
TypeSmall organic molecule
Emp. Form.C8H11NO5S
Mol. Mass.233.242
SMILESCC1(C)[C@@H](N2[C@@H](CC2=O)S1(=O)=O)C(O)=O