Reaction Details
TargetAlanine racemase, biosynthetic
LigandBDBM50022058
Substrate/Competitorn/a
Meas. Tech.ChEMBL_30522 (CHEMBL643170)
Ki 15000000±n/a nM
Citation Vo-Quang, YCarniato, DVo-Quang, LLacoste, AMNeuzil, ELe Goffic, F (beta-Chloro-alpha-aminoethyl)phosphonic acids as inhibitors of alanine racemase and D-alanine:D-alanine ligase. J Med Chem29:148-51 (1986) Alanine racemase, biosynthetic
Name:Alanine racemase, biosynthetic
Type:PROTEIN
Mol. Mass.:39155.52
Organism:Escherichia coli (strain K12)
Description:ChEMBL_30522
Residue:359
BDBM50022058
NameBDBM50022058
Synonyms:(1-Amino-2,2-dichloro-ethyl)-phosphonic acid | CHEMBL288476
TypeSmall organic molecule
Emp. Form.C2H6Cl2NO3P
Mol. Mass.193.954
SMILESNC(C(Cl)Cl)P(O)(O)=O