Reaction Details
TargetDNA topoisomerase 3
LigandBDBM50022163
Substrate/Competitorn/a
Meas. Tech.ChEMBL_54523 (CHEMBL663870)
Ki 400±n/a nM
Citation Trantolo, DJWright, GEBrown, NC Inhibitors of Bacillus subtilis DNA polymerase III. Influence of modifications in the pyrimidine ring of anilino- and (benzylamino)pyrimidines. J Med Chem29:676-81 (1986) DNA topoisomerase 3
Name:DNA topoisomerase 3
Type:PROTEIN
Mol. Mass.:81515.22
Organism:Bacillus subtilis
Description:ChEMBL_54525
Residue:727
BDBM50022163
NameBDBM50022163
Synonyms:6-(Indan-5-ylamino)-1H-pyrimidine-2,4-dione | CHEMBL54950
TypeSmall organic molecule
Emp. Form.C13H13N3O2
Mol. Mass.243.2612
SMILESO=c1cc(Nc2ccc3CCCc3c2)[nH]c(=O)[nH]1