Reaction Details
TargetAldo-keto reductase family 1 member B1
LigandBDBM50022263
Substrate/Competitorn/a
Meas. Tech.ChEBML_31911
IC50 760±n/a nM
Citation Cerelli, MJCurtis, DLDunn, JPNelson, PHPeak, TMWaterbury, LD Antiinflammatory and aldose reductase inhibitory activity of some tricyclic arylacetic acids. J Med Chem29:2347-51 (1986) Aldo-keto reductase family 1 member B1
Name:Aldo-keto reductase family 1 member B1
Type:Protein
Mol. Mass.:35855.50
Organism:Homo sapiens (Human)
Description:P15121. 4LAU; 2IKI; 4LB4; 2FZD; 2FZ8; 1US0
Residue:316
BDBM50022263
NameBDBM50022263
Synonyms:(4-Hydroxy-5-oxo-5H-dibenzo[a,d]cyclohepten-2-yl)-acetic acid | CHEMBL77283
TypeSmall organic molecule
Emp. Form.C17H12O4
Mol. Mass.280.2748
SMILESOC(=O)Cc1cc(O)c2c(c1)ccc1ccccc1c2=O