Reaction Details
TargetAldo-keto reductase family 1 member B1
LigandBDBM50022272
Substrate/Competitorn/a
Meas. Tech.ChEBML_31911
IC50 100000±n/a nM
Citation Cerelli, MJCurtis, DLDunn, JPNelson, PHPeak, TMWaterbury, LD Antiinflammatory and aldose reductase inhibitory activity of some tricyclic arylacetic acids. J Med Chem29:2347-51 (1986) Aldo-keto reductase family 1 member B1
Name:Aldo-keto reductase family 1 member B1
Type:Protein
Mol. Mass.:35855.50
Organism:Homo sapiens (Human)
Description:P15121. 4LAU; 2IKI; 4LB4; 2FZD; 2FZ8; 1US0
Residue:316
BDBM50022272
NameBDBM50022272
Synonyms:(8-Hydroxy-5-oxo-10,11-dihydro-5H-dibenzo[a,d]cyclohepten-2-yl)-acetic acid | CHEMBL75244
TypeSmall organic molecule
Emp. Form.C17H14O4
Mol. Mass.282.2907
SMILESOC(=O)Cc1ccc2c(CCc3cc(O)ccc3C2=O)c1