Reaction Details
TargetPepsin A
LigandBDBM50022508
Substrate/Competitorn/a
Meas. Tech.ChEBML_153984
pH2±n/a
IC50 6.8±n/a nM
Commentsextracted
Citation Maibaum, JRich, DH Inhibition of porcine pepsin by two substrate analogues containing statine. The effect of histidine at the P2 subsite on the inhibition of aspartic proteinases. J Med Chem31:625-9 (1988) Pepsin A
Name:Pepsin A
Type:Enzyme
Mol. Mass.:41232.87
Organism:Porcine
Description:n/a
Residue:385
BDBM50022508
NameBDBM50022508
Synonyms:Boc-Pro-Phe-NMe-His-Leu-OHCH2-Val-Ile-Amp | CHEMBL362209
TypeSmall organic molecule
Emp. Form.C50H75N9O8
Mol. Mass.930.186
SMILESCC[C@H](C)[C@H](NC(=O)C(CC(O)C(CC(C)C)NC(=O)[C@H](Cc1cnc[nH]1)N(C)C(=O)[C@H](Cc1ccccc1)NC(=O)[C@@H]1CCCN1C(=O)OC(C)(C)C)C(C)C)C(=O)NCc1ccccn1