Reaction Details
TargetPepsin A
LigandBDBM50022520
Substrate/Competitorn/a
Meas. Tech.ChEMBL_154006 (CHEMBL759127)
pH4±n/a
Ki<1±n/a nM
Commentsextracted
Citation Maibaum, JRich, DH Inhibition of porcine pepsin by two substrate analogues containing statine. The effect of histidine at the P2 subsite on the inhibition of aspartic proteinases. J Med Chem31:625-9 (1988) Pepsin A
Name:Pepsin A
Type:Enzyme
Mol. Mass.:41232.87
Organism:Porcine
Description:n/a
Residue:385
BDBM50022520
NameBDBM50022520
Synonyms:CHEMBL3349395 | H2N-Abu-Pro-Phe-Abu-Sta-Leu-PheOMe
TypeSmall organic molecule
Emp. Form.C46H69N7O9
Mol. Mass.864.0816
SMILESCOC(=O)[C@H](Cc1ccccc1)NC(=O)[C@H](CC(C)C)NC(=O)CC(O)[C@H](CC(C)C)NC(=O)CCCNC(=O)[C@H](Cc1ccccc1)NC(=O)[C@@H]1CCCN1C(=O)CCCN