Reaction Details
TargetPepsin A
LigandBDBM50022509
Substrate/Competitorn/a
Meas. Tech.ChEBML_153984
pH2±n/a
IC50 14±n/a nM
Commentsextracted
Citation Maibaum, JRich, DH Inhibition of porcine pepsin by two substrate analogues containing statine. The effect of histidine at the P2 subsite on the inhibition of aspartic proteinases. J Med Chem31:625-9 (1988) Pepsin A
Name:Pepsin A
Type:Enzyme
Mol. Mass.:41232.87
Organism:Porcine
Description:n/a
Residue:385
BDBM50022509
NameBDBM50022509
Synonyms:Boc-Phe-Phe-Sta-Ala-Sta-OMe | CHEMBL3349390
TypeSmall organic molecule
Emp. Form.C43H65N5O10
Mol. Mass.812.0037
SMILESCOC(=O)CC(O)[C@H](CC(C)C)NC(=O)[C@H](C)NC(=O)CC(O)[C@H](CC(C)C)NC(=O)[C@H](Cc1ccccc1)NC(=O)[C@H](Cc1ccccc1)NC(=O)OC(C)(C)C