Reaction Details
TargetPepsin A
LigandBDBM50022512
Substrate/Competitorn/a
Meas. Tech.ChEMBL_154006 (CHEMBL759127)
pH4±n/a
Ki 4±n/a nM
Commentsextracted
Citation Maibaum, JRich, DH Inhibition of porcine pepsin by two substrate analogues containing statine. The effect of histidine at the P2 subsite on the inhibition of aspartic proteinases. J Med Chem31:625-9 (1988) Pepsin A
Name:Pepsin A
Type:Enzyme
Mol. Mass.:41232.87
Organism:Porcine
Description:n/a
Residue:385
BDBM50022512
NameBDBM50022512
Synonyms:CHEMBL3349394 | Ibu-His-Pro-Phe-Ala-Sta-Leu-PheNH2
TypeSmall organic molecule
Emp. Form.C50H72N10O9
Mol. Mass.957.1683
SMILESCC(C)C[C@H](NC(=O)[C@H](C)NC(=O)[C@H](Cc1ccccc1)NC(=O)[C@@H]1CCCN1C(=O)[C@H](Cc1c[nH]cn1)NC(=O)C(C)C)C(O)CC(=O)N[C@@H](CC(C)C)C(=O)N[C@@H](Cc1ccccc1)C(N)=O