Reaction Details
TargetRenin
LigandBDBM50022530
Substrate/Competitorn/a
Meas. Tech.ChEMBL_195965 (CHEMBL806859)
IC50 25.0±n/a nM
Citation Iizuka, KKamijo, TKubota, TAkahane, KUmeyama, HKiso, Y New human renin inhibitors containing an unnatural amino acid, norstatine. J Med Chem31:701-4 (1988) Renin
Name:Renin
Type:Enzyme
Mol. Mass.:45058.99
Organism:Homo sapiens (Human)
Description:n/a
Residue:406
BDBM50022530
NameBDBM50022530
Synonyms:3-[2-(3-Dimethylcarbamoyl-2-naphthalen-1-ylmethyl-propionylamino)-3-(1H-imidazol-4-yl)-propionylamino]-2-hydroxy-5-methyl-hexanoic acid methyl ester | CHEMBL350425
TypeSmall organic molecule
Emp. Form.C31H41N5O6
Mol. Mass.579.6871
SMILESCOC(=O)C(O)C(CC(C)C)NC(=O)C(Cc1cnc[nH]1)NC(=O)C(CC(=O)N(C)C)Cc1cccc2ccccc12