Reaction Details
TargetRenin
LigandBDBM50022529
Substrate/Competitorn/a
Meas. Tech.ChEMBL_195965 (CHEMBL806859)
IC50 24±n/a nM
Citation Iizuka, KKamijo, TKubota, TAkahane, KUmeyama, HKiso, Y New human renin inhibitors containing an unnatural amino acid, norstatine. J Med Chem31:701-4 (1988) Renin
Name:Renin
Type:Enzyme
Mol. Mass.:45058.99
Organism:Homo sapiens (Human)
Description:n/a
Residue:406
BDBM50022529
NameBDBM50022529
Synonyms:2-Hydroxy-3-[3-(1H-imidazol-4-yl)-2-(2-naphthalen-1-ylmethyl-4-oxo-4-piperidin-1-yl-butyrylamino)-propionylamino]-5-methyl-hexanoic acid methyl ester | CHEMBL159336
TypeSmall organic molecule
Emp. Form.C34H45N5O6
Mol. Mass.619.751
SMILESCOC(=O)C(O)C(CC(C)C)NC(=O)C(Cc1cnc[nH]1)NC(=O)C(CC(=O)N1CCCCC1)Cc1cccc2ccccc12