Reaction Details
TargetRenin
LigandBDBM50022527
Substrate/Competitorn/a
Meas. Tech.ChEMBL_195965 (CHEMBL806859)
IC50 66.0±n/a nM
Citation Iizuka, KKamijo, TKubota, TAkahane, KUmeyama, HKiso, Y New human renin inhibitors containing an unnatural amino acid, norstatine. J Med Chem31:701-4 (1988) Renin
Name:Renin
Type:Enzyme
Mol. Mass.:45058.99
Organism:Homo sapiens (Human)
Description:n/a
Residue:406
BDBM50022527
NameBDBM50022527
Synonyms:3-Hydroxy-4-[3-(1H-imidazol-4-yl)-2-(4-morpholin-4-yl-2-naphthalen-1-ylmethyl-4-oxo-butyrylamino)-propionylamino]-6-methyl-heptanoic acid isopropyl ester | CHEMBL159720
TypeSmall organic molecule
Emp. Form.C36H49N5O7
Mol. Mass.663.8036
SMILESCC(C)CC(NC(=O)C(Cc1cnc[nH]1)NC(=O)C(CC(=O)N1CCOCC1)Cc1cccc2ccccc12)C(O)CC(=O)OC(C)C