Reaction Details
TargetRenin
LigandBDBM50022524
Substrate/Competitorn/a
Meas. Tech.ChEMBL_195964 (CHEMBL806858)
IC50 130±n/a nM
Citation Iizuka, KKamijo, TKubota, TAkahane, KUmeyama, HKiso, Y New human renin inhibitors containing an unnatural amino acid, norstatine. J Med Chem31:701-4 (1988) Renin
Name:Renin
Type:Enzyme
Mol. Mass.:45058.99
Organism:Homo sapiens (Human)
Description:n/a
Residue:406
BDBM50022524
NameBDBM50022524
Synonyms:2-Hydroxy-3-[3-(1H-imidazol-4-yl)-2-(4-morpholin-4-yl-2-naphthalen-1-ylmethyl-4-oxo-butyrylamino)-propionylamino]-5-methyl-hexanoic acid isopropylamide | CHEMBL159479
TypeSmall organic molecule
Emp. Form.C35H48N6O6
Mol. Mass.648.7922
SMILESCC(C)CC(NC(=O)C(Cc1cnc[nH]1)NC(=O)C(CC(=O)N1CCOCC1)Cc1cccc2ccccc12)C(O)C(=O)NC(C)C