Reaction Details
TargetThymidylate synthase
LigandBDBM50022738
Substrate/Competitorn/a
Meas. Tech.ChEBML_209295
IC50 2900±n/a nM
Citation Piper, JRMcCaleb, GSMontgomery, JAKisliuk, RLGaumont, YThorndike, JSirotnak, FM Synthesis and antifolate activity of 5-methyl-5,10-dideaza analogues of aminopterin and folic acid and an alternative synthesis of 5,10-dideazatetrahydrofolic acid, a potent inhibitor of glycinamide ribonucleotide formyltransferase. J Med Chem31:2164-9 (1988) Thymidylate synthase
Name:Thymidylate synthase
Type:Enzyme
Mol. Mass.:36576.54
Organism:Lactobacillus casei
Description:n/a
Residue:316
BDBM50022738
NameBDBM50022738
Synonyms:2-{4-[2-(2,4-Diamino-5-methyl-pyrido[2,3-d]pyrimidin-6-yl)-ethyl]-benzoylamino}-pentanedioic acid | CHEMBL69016
TypeSmall organic molecule
Emp. Form.C22H24N6O5
Mol. Mass.452.4632
SMILESCc1c(CCc2ccc(cc2)C(=O)NC(CCC(O)=O)C(O)=O)cnc2nc(N)nc(N)c12