Reaction Details
TargetBeta-lactamase TEM
LigandBDBM50022788
Substrate/Competitorn/a
Meas. Tech.ChEBML_40718
Ki 13000±n/a nM
Citation Joyeau, RMolines, HLabia, RWakselman, M N-aryl 3-halogenated azetidin-2-ones and benzocarbacephems, inhibitors of beta-lactamases. J Med Chem31:370-4 (1988) Beta-lactamase TEM
Name:Beta-lactamase TEM
Type:Enzyme
Mol. Mass.:31512.33
Organism:Escherichia coli
Description:P62593
Residue:286
BDBM50022788
NameBDBM50022788
Synonyms:(2S,5R,6R)-6-(3-(2-chlorophenyl)-5-methylisoxazole-4-carboxamido)-3,3-dimethyl-7-oxo-4-thia-1-aza-bicyclo[3.2.0]heptane-2-carboxylic acid 6-{[3-(2-Chloro-phenyl)-5-methyl-isoxazole-4-carbonyl]-amino}-3,3-dimethyl-7-oxo-4-thia-1-aza-bicyclo[3.2.0]heptane-2-carboxylic acid CLOXAPEN cloxacillin
TypeSmall organic molecule
Emp. Form.C19H18ClN3O5S
Mol. Mass.435.881
SMILESCc1onc(c1C(=O)N[C@H]1[C@H]2SC(C)(C)[C@@H](N2C1=O)C(O)=O)-c1ccccc1Cl