Reaction Details
TargetBeta-lactamase TEM
LigandBDBM50022790
Substrate/Competitorn/a
Meas. Tech.ChEBML_40718
Ki 20000±n/a nM
Citation Joyeau, RMolines, HLabia, RWakselman, M N-aryl 3-halogenated azetidin-2-ones and benzocarbacephems, inhibitors of beta-lactamases. J Med Chem31:370-4 (1988) Beta-lactamase TEM
Name:Beta-lactamase TEM
Type:Enzyme
Mol. Mass.:31512.33
Organism:Escherichia coli
Description:P62593
Residue:286
BDBM50022790
NameBDBM50022790
Synonyms:1-Oxo-2,2a,3,4-tetrahydro-1H-azeto[1,2-a]quinoline-7-carboxylic acid | CHEMBL333494
TypeSmall organic molecule
Emp. Form.C12H11NO3
Mol. Mass.217.2206
SMILESOC(=O)c1ccc2CCC3CC(=O)N3c2c1