Reaction Details
TargetRenin-1
LigandBDBM50022867
Substrate/Competitorn/a
Meas. Tech.ChEBML_196286
IC50 400±n/a nM
Citation Sham, HLBolis, GStein, HHFesik, SWMarcotte, PAPlattner, JJRempel, CAGreer, J Renin inhibitors. Design and synthesis of a new class of conformationally restricted analogues of angiotensinogen. J Med Chem31:284-95 (1988) Renin-1
Name:Renin-1
Type:PROTEIN
Mol. Mass.:44345.30
Organism:Mus musculus
Description:ChEMBL_685608
Residue:402
BDBM50022867
NameBDBM50022867
Synonyms:2-[2-(2-{[7-(2-tert-Butoxycarbonylamino-3-phenyl-propionyl)-6-methyl-5-oxo-1-oxa-4,7-diaza-cyclododecane-3-carbonyl]-amino}-3-methyl-butyrylamino)-3-methyl-pentanoylamino]-3-(3H-imidazol-4-yl)-propionic acid methyl ester | CHEMBL97865
TypeSmall organic molecule
Emp. Form.C43H66N8O10
Mol. Mass.855.0317
SMILESCC[C@H](C)[C@H](NC(=O)[C@@H](NC(=O)[C@H]1COCCCCCN([C@H](C)C(=O)N1)C(=O)[C@H](Cc1ccccc1)NC(=O)OC(C)(C)C)C(C)C)C(=O)N[C@@H](Cc1cnc[nH]1)C(=O)OC