Reaction Details
TargetRenin-1
LigandBDBM50022862
Substrate/Competitorn/a
Meas. Tech.ChEBML_196286
IC50 500±n/a nM
Citation Sham, HLBolis, GStein, HHFesik, SWMarcotte, PAPlattner, JJRempel, CAGreer, J Renin inhibitors. Design and synthesis of a new class of conformationally restricted analogues of angiotensinogen. J Med Chem31:284-95 (1988) Renin-1
Name:Renin-1
Type:PROTEIN
Mol. Mass.:44345.30
Organism:Mus musculus
Description:ChEMBL_685608
Residue:402
BDBM50022862
NameBDBM50022862
Synonyms:Boc-Phe-Ala-Leu-Val-Ile-His-OMe | CHEMBL101874
TypeSmall organic molecule
Emp. Form.C41H64N8O9
Mol. Mass.812.9951
SMILESCC[C@H](C)[C@H](NC(=O)[C@@H](NC(=O)[C@H](CC(C)C)NC(=O)[C@H](C)NC(=O)[C@H](Cc1ccccc1)NC(=O)OC(C)(C)C)C(C)C)C(=O)N[C@@H](Cc1cnc[nH]1)C(=O)OC