Reaction Details
TargetRenin
LigandBDBM50023056
Substrate/Competitorn/a
Meas. Tech.ChEBML_196259
Ki 12000±n/a nM
Citation Fearon, KSpaltenstein, AHopkins, PBGelb, MH Fluoro ketone containing peptides as inhibitors of human renin. J Med Chem30:1617-22 (1987) Renin
Name:Renin
Type:Enzyme
Mol. Mass.:45058.99
Organism:Homo sapiens (Human)
Description:n/a
Residue:406
BDBM50023056
NameBDBM50023056
Synonyms:CHEMBL290282 | [1-Benzyl-4-(1-{2-[1-(1-carbamoyl-2-phenyl-ethylcarbamoyl)-3-methyl-butylcarbamoyl]-2,2-difluoro-1-hydroxy-ethyl}-3-methyl-butylcarbamoyl)-5-phenyl-pent-2-enyl]-carbamic acid tert-butyl ester
TypeSmall organic molecule
Emp. Form.C47H63F2N5O7
Mol. Mass.848.0292
SMILESCC(C)C[C@H](NC(=O)[C@H](Cc1ccccc1)\C=C\[C@H](Cc1ccccc1)NC(=O)OC(C)(C)C)[C@@H](O)C(F)(F)C(=O)N[C@@H](CC(C)C)C(=O)N[C@@H](Cc1ccccc1)C(N)=O