Reaction Details
TargetDihydrofolate reductase
LigandBDBM50023707
Substrate/Competitorn/a
Meas. Tech.ChEBML_54446
IC50 63±n/a nM
Citation Rosowsky, AForsch, RAMoran, RGKohler, WFreisheim, JH Methotrexate analogues. 32. Chain extension, alpha-carboxyl deletion, and gamma-carboxyl replacement by sulfonate and phosphonate: effect on enzyme binding and cell-growth inhibition. J Med Chem31:1326-31 (1988) Dihydrofolate reductase
Name:Dihydrofolate reductase
Type:Enzyme
Mol. Mass.:21608.82
Organism:Mus musculus (Mouse)
Description:n/a
Residue:187
BDBM50023707
NameBDBM50023707
Synonyms:2-{4-[(2,4-Diamino-pteridin-6-ylmethyl)-amino]-benzoylamino}-4-phosphono-butyric acid | CHEMBL27149
TypeSmall organic molecule
Emp. Form.C18H21N8O6P
Mol. Mass.476.3831
SMILESNc1nc(N)c2nc(CNc3ccc(cc3)C(=O)NC(CCP(O)(O)=O)C(O)=O)cnc2n1