Reaction Details
TargetNeprilysin
LigandBDBM50024100
Substrate/Competitorn/a
Meas. Tech.ChEBML_64511
IC50 0.540000±n/a nM
Citation Fournié-Zaluski, MCLucas-Soroca, EDevin, JRoques, BP 1H NMR configurational correlation for retro-inverso dipeptides: application to the determination of the absolute configuration of"enkephalinase" inhibitors. Relationships between stereochemistry and enzyme recognition. J Med Chem29:751-7 (1986) Neprilysin
Name:Neprilysin
Type:Protein
Mol. Mass.:85789.59
Organism:Rattus norvegicus (Rat)
Description:P07861
Residue:750
BDBM50024100
NameBDBM50024100
Synonyms:(R,S) N-(1-Mercaptomethyl-2-phenyl-ethyl)-2-methyl-malonamic acid | CHEMBL165922
TypeSmall organic molecule
Emp. Form.C13H17NO3S
Mol. Mass.267.344
SMILESC[C@@H](C(O)=O)C(=O)N[C@H](CS)Cc1ccccc1