Reaction Details
TargetNeprilysin
LigandBDBM50024102
Substrate/Competitorn/a
Meas. Tech.ChEBML_64511
IC50 1.9±n/a nM
Citation Fournié-Zaluski, MCLucas-Soroca, EDevin, JRoques, BP 1H NMR configurational correlation for retro-inverso dipeptides: application to the determination of the absolute configuration of"enkephalinase" inhibitors. Relationships between stereochemistry and enzyme recognition. J Med Chem29:751-7 (1986) Neprilysin
Name:Neprilysin
Type:Protein
Mol. Mass.:85789.59
Organism:Rattus norvegicus (Rat)
Description:P07861
Residue:750
BDBM50024102
NameBDBM50024102
Synonyms:((S)-2-Mercaptomethyl-3-phenyl-propionylamino)-acetic acid (S) (2-Mercaptomethyl-3-phenyl-propionylamino)-acetic acid CHEMBL298827
TypeSmall organic molecule
Emp. Form.C12H15NO3S
Mol. Mass.253.317
SMILESOC(=O)CNC(=O)[C@@H](CS)Cc1ccccc1