Reaction Details
TargetDihydrofolate reductase
LigandBDBM50024470
Substrate/Competitorn/a
Meas. Tech.ChEBML_54896
IC50>200000±n/a nM
Citation Nair, MGDhawan, RGhazala, MKalman, TIFerone, RGaumont, YKisliuk, RL Folate analogues. 30. Synthesis and biological evaluation of N10-propargyl-5,8-dideaza-5,6,7,8-tetrahydrofolic acid and related compounds. J Med Chem30:1256-61 (1987) Dihydrofolate reductase
Name:Dihydrofolate reductase
Type:PROTEIN
Mol. Mass.:18437.08
Organism:Lactobacillus casei
Description:ChEMBL_1357878
Residue:163
BDBM50024470
NameBDBM50024470
Synonyms:4-[(2-Amino-4-oxo-3,4,5,6,7,8-hexahydro-quinazolin-6-ylmethyl)-methyl-amino]-benzoic acid | CHEMBL22449
TypeSmall organic molecule
Emp. Form.C17H20N4O3
Mol. Mass.328.3657
SMILESCN(CC1CCc2nc(N)[nH]c(=O)c2C1)c1ccc(cc1)C(O)=O