Reaction Details
TargetThymidylate synthase
LigandBDBM50024475
Substrate/Competitorn/a
Meas. Tech.ChEMBL_209806 (CHEMBL815672)
IC50 12000±n/a nM
Citation Nair, MGDhawan, RGhazala, MKalman, TIFerone, RGaumont, YKisliuk, RL Folate analogues. 30. Synthesis and biological evaluation of N10-propargyl-5,8-dideaza-5,6,7,8-tetrahydrofolic acid and related compounds. J Med Chem30:1256-61 (1987) Thymidylate synthase
Name:Thymidylate synthase
Type:PROTEIN
Mol. Mass.:34957.15
Organism:Mus musculus
Description:ChEMBL_1340097
Residue:307
BDBM50024475
NameBDBM50024475
Synonyms:2-{4-[(2-Amino-4-oxo-1,4,5,6,7,8-hexahydro-quinazolin-6-ylmethyl)-amino]-benzoylamino}-pentanedioic acid CHEMBL279508
TypeSmall organic molecule
Emp. Form.C21H25N5O6
Mol. Mass.443.4531
SMILESNc1nc2CCC(CNc3ccc(cc3)C(=O)NC(CCC(O)=O)C(O)=O)Cc2c(=O)[nH]1