Reaction Details
TargetThymidylate synthase
LigandBDBM50023902
Substrate/Competitorn/a
Meas. Tech.ChEMBL_209806 (CHEMBL815672)
IC50 10000±n/a nM
Citation Nair, MGDhawan, RGhazala, MKalman, TIFerone, RGaumont, YKisliuk, RL Folate analogues. 30. Synthesis and biological evaluation of N10-propargyl-5,8-dideaza-5,6,7,8-tetrahydrofolic acid and related compounds. J Med Chem30:1256-61 (1987) Thymidylate synthase
Name:Thymidylate synthase
Type:PROTEIN
Mol. Mass.:34957.15
Organism:Mus musculus
Description:ChEMBL_1340097
Residue:307
BDBM50023902
NameBDBM50023902
Synonyms:2-{4-[(2-Amino-4-oxo-1,4-dihydro-quinazolin-6-ylmethyl)-amino]-benzoylamino}-pentanedioic acid (DDF) CHEMBL22973 | TCMDC-132046
TypeSmall organic molecule
Emp. Form.C21H21N5O6
Mol. Mass.439.4213
SMILESNc1nc2ccc(CNc3ccc(cc3)C(=O)N[C@@H](CCC(O)=O)C(O)=O)cc2c(=O)[nH]1