Reaction Details
TargetDihydrofolate reductase
LigandBDBM50024473
Substrate/Competitorn/a
Meas. Tech.ChEBML_54896
IC50 10000±n/a nM
Citation Nair, MGDhawan, RGhazala, MKalman, TIFerone, RGaumont, YKisliuk, RL Folate analogues. 30. Synthesis and biological evaluation of N10-propargyl-5,8-dideaza-5,6,7,8-tetrahydrofolic acid and related compounds. J Med Chem30:1256-61 (1987) Dihydrofolate reductase
Name:Dihydrofolate reductase
Type:PROTEIN
Mol. Mass.:18437.08
Organism:Lactobacillus casei
Description:ChEMBL_1357878
Residue:163
BDBM50024473
NameBDBM50024473
Synonyms:2-{4-[(2-Amino-4-oxo-3,4,5,6,7,8-hexahydro-quinazolin-6-ylmethyl)-prop-2-ynyl-amino]-benzoylamino}-pentanedioic acid (H4-PDDF) | CHEMBL22793
TypeSmall organic molecule
Emp. Form.C24H27N5O6
Mol. Mass.481.5011
SMILESNc1nc2CCC(CN(CC#C)c3ccc(cc3)C(=O)NC(CCC(O)=O)C(O)=O)Cc2c(=O)[nH]1