Reaction Details
TargetAromatase
LigandBDBM50015985
Substrate/Competitorn/a
Meas. Tech.ChEMBL_51034 (CHEMBL662247)
Ki 1100±n/a nM
Citation Leung, CSRowlands, MGJarman, MFoster, ABGriggs, LJWilman, DE Analogues of 3-ethyl-3-(4-pyridyl)piperidine-2,6-dione as selective inhibitors of aromatase: derivatives with variable 1-alkyl and 3-alkyl substituents. J Med Chem30:1550-4 (1987) Aromatase
Name:Aromatase
Type:Enzyme
Mol. Mass.:57888.92
Organism:Homo sapiens (Human)
Description:P11511
Residue:503
BDBM50015985
NameBDBM50015985
Synonyms:3-Ethyl-4,5-dihydro-3H-[3,4']bipyridinyl-2,6-dione Rogletimide
TypeSmall organic molecule
Emp. Form.C12H14N2O2
Mol. Mass.218.2518
SMILESCCC1(CCC(=O)NC1=O)c1ccncc1