Reaction Details
Target3-hydroxy-3-methylglutaryl-coenzyme A reductase
LigandBDBM50226272
Substrate/Competitorn/a
Meas. Tech.ChEMBL_80654 (CHEMBL880029)
IC50 1.4±n/a nM
Citation Hoffman, WFAlberts, AWAnderson, PSChen, JSSmith, RLWillard, AK 3-Hydroxy-3-methylglutaryl-coenzyme A reductase inhibitors. 4. Side chain ester derivatives of mevinolin. J Med Chem29:849-52 (1986) 3-hydroxy-3-methylglutaryl-coenzyme A reductase
Name:3-hydroxy-3-methylglutaryl-coenzyme A reductase
Type:Enzyme
Mol. Mass.:96689.85
Organism:Rattus norvegicus (rat)
Description:Isolated rat liver microsomes were used as enzyme source.
Residue:887
BDBM50226272
NameBDBM50226272
Synonyms:CHEMBL3349944
TypeSmall organic molecule
Emp. Form.C26H40O5
Mol. Mass.432.5928
SMILESCCC(C)(CC)C(=O)O[C@H]1C[C@@H](C)C=C2C=C[C@H](C)[C@H](CC[C@@H]3C[C@@H](O)CC(=O)O3)C12