Reaction Details
TargetDihydrofolate reductase
LigandBDBM50405400
Substrate/Competitorn/a
Meas. Tech.ChEBML_54594
Ki 0.003±n/a nM
Citation DeGraw, JIChristie, PHTagawa, HKisliuk, RLGaumont, YSchmid, FASirotnak, FM Synthesis and biological activity of resolved C-10 diastereomers of 10-methyl- and 10-ethyl-10-deazaminopterin. J Med Chem29:1056-61 (1986) Dihydrofolate reductase
Name:Dihydrofolate reductase
Type:Enzyme
Mol. Mass.:21608.82
Organism:Mus musculus (Mouse)
Description:n/a
Residue:187
BDBM50405400
NameBDBM50405400
Synonyms:CHEMBL2051987
TypeSmall organic molecule
Emp. Form.C21H23N7O5
Mol. Mass.453.4512
SMILESC[C@H](Cc1cnc2nc(N)nc(N)c2n1)c1ccc(cc1)C(=O)N[C@@H](CCC(O)=O)C(O)=O