Reaction Details
TargetAromatase
LigandBDBM50025155
Substrate/Competitorn/a
Meas. Tech.ChEMBL_51017 (CHEMBL664409)
Ki 800±n/a nM
Citation Daly, MJJones, GWNicholls, PJSmith, HJRowlands, MGBunnett, MA Synthesis and biochemical evaluation of analogues of aminoglutethimide based on phenylpyrrolidine-2,5-dione. J Med Chem29:520-3 (1986) Aromatase
Name:Aromatase
Type:Enzyme
Mol. Mass.:57888.92
Organism:Homo sapiens (Human)
Description:P11511
Residue:503
BDBM50025155
NameBDBM50025155
Synonyms:3-(4-Amino-phenyl)-3-methyl-pyrrolidine-2,5-dione | CHEMBL149238
TypeSmall organic molecule
Emp. Form.C11H12N2O2
Mol. Mass.204.2252
SMILESCC1(CC(=O)NC1=O)c1ccc(N)cc1