Reaction Details
TargetCarnitine palmitoyl transferase I liver isoform
LigandBDBM50025263
Substrate/Competitorn/a
Meas. Tech.ChEBML_44012
IC50 600±n/a nM
Citation Ho, WTutwiler, GFCottrell, SCMorgans, DJTarhan, OMohrbacher, RJ Alkylglycidic acids: potential new hypoglycemic agents. J Med Chem29:2184-90 (1986) Carnitine palmitoyl transferase I liver isoform
Name:Carnitine palmitoyl transferase I liver isoform
Synonyms:Carnitine palmitoyltransferase 1A
Type:PROTEIN
Mol. Mass.:30247.29
Organism:Sus scrofa
Description:ChEMBL_44012
Residue:263
BDBM50025263
NameBDBM50025263
TypeSmall organic molecule
Emp. Form.C16H30O3
Mol. Mass.270.4076
SMILESCCCCCCCCCCCCC1(CO1)C(=O)OC