Reaction Details
TargetAdenosine receptor A2a
LigandBDBM50001514
Substrate/Competitorn/a
Meas. Tech.ChEBML_27755
Ki 5000±n/a nM
Citation Daly, JWPadgett, WLShamim, MT Analogues of caffeine and theophylline: effect of structural alterations on affinity at adenosine receptors. J Med Chem29:1305-8 (1987) Adenosine receptor A2a
Name:Adenosine receptor A2a
Type:Enzyme Catalytic Domain
Mol. Mass.:44955.08
Organism:GUINEA PIG
Description:ADENOSINE A2 0 GUINEA PIG::P46616
Residue:409
BDBM50001514
NameBDBM50001514
Synonyms:1-Ethyl-3-methyl-3,7-dihydro-purine-2,6-dione | CHEMBL24107
TypeSmall organic molecule
Emp. Form.C8H10N4O2
Mol. Mass.194.1906
SMILESCCn1c(=O)n(C)c2nc[nH]c2c1=O