Reaction Details
TargetAdenosine receptor A2a
LigandBDBM15336
Substrate/Competitorn/a
Meas. Tech.ChEBML_27755
Ki 8000±n/a nM
Citation Daly, JWPadgett, WLShamim, MT Analogues of caffeine and theophylline: effect of structural alterations on affinity at adenosine receptors. J Med Chem29:1305-8 (1987) Adenosine receptor A2a
Name:Adenosine receptor A2a
Type:Enzyme Catalytic Domain
Mol. Mass.:44955.08
Organism:GUINEA PIG
Description:ADENOSINE A2 0 GUINEA PIG::P46616
Residue:409
BDBM15336
NameBDBM15336
Synonyms:1-methyl-3-(2-methylpropyl)-2,3,6,7-tetrahydro-1H-purine-2,6-dione 3-Isobutyl-1-methylxanthine IBMX | isobutylmethylxanthine
TypeSmall organic molecule
Emp. Form.C10H14N4O2
Mol. Mass.222.2438
SMILESCC(C)Cn1c2nc[nH]c2c(=O)n(C)c1=O