Reaction Details
TargetDNA polymerase alpha catalytic subunit
LigandBDBM50013093
Substrate/Competitorn/a
Meas. Tech.ChEMBL_50805 (CHEMBL659773)
Ki 1760000±n/a nM
Citation Wright, GEDudycz, LWKazimierczuk, ZBrown, NCKhan, NN Synthesis, cell growth inhibition, and antitumor screening of 2-(p-n-butylanilino)purines and their nucleoside analogues. J Med Chem30:109-16 (1987) DNA polymerase alpha catalytic subunit
Name:DNA polymerase alpha catalytic subunit
Type:PROTEIN
Mol. Mass.:165895.25
Organism:Homo sapiens (Human)
Description:ChEMBL_1365493
Residue:1462
BDBM50013093
NameBDBM50013093
Synonyms:2-(3-Ethyl-4-methyl-phenylamino)-1,9-dihydro-purin-6-one | CHEMBL16026
TypeSmall organic molecule
Emp. Form.C14H15N5O
Mol. Mass.269.3018
SMILESCCc1cc(Nc2nc3nc[nH]c3c(=O)[nH]2)ccc1C