Reaction Details
TargetDNA polymerase alpha catalytic subunit
LigandBDBM50013074
Substrate/Competitorn/a
Meas. Tech.ChEBML_50805
Ki 12000±n/a nM
Citation Wright, GEDudycz, LWKazimierczuk, ZBrown, NCKhan, NN Synthesis, cell growth inhibition, and antitumor screening of 2-(p-n-butylanilino)purines and their nucleoside analogues. J Med Chem30:109-16 (1987) DNA polymerase alpha catalytic subunit
Name:DNA polymerase alpha catalytic subunit
Type:PROTEIN
Mol. Mass.:165895.25
Organism:Homo sapiens (Human)
Description:ChEMBL_1365493
Residue:1462
BDBM50013074
NameBDBM50013074
Synonyms:2-(4-Butyl-phenylamino)-1,9-dihydro-purin-6-one CHEMBL16193
TypeSmall organic molecule
Emp. Form.C15H17N5O
Mol. Mass.283.3284
SMILESCCCCc1ccc(Nc2nc3nc[nH]c3c(=O)[nH]2)cc1