Reaction Details
TargetAdenosine receptor A1
LigandBDBM50025682
Substrate/Competitorn/a
Meas. Tech.ChEBML_29624
Ki 13±n/a nM
Citation Jacobson, KAUkena, DPadgett, WDaly, JWKirk, KL Xanthine functionalized congeners as potent ligands at A2-adenosine receptors. J Med Chem30:211-4 (1987) Adenosine receptor A1
Name:Adenosine receptor A1
Type:Protein
Mol. Mass.:36704.13
Organism:Rattus norvegicus (rat)
Description:n/a
Residue:326
BDBM50025682
NameBDBM50025682
Synonyms:CHEMBL66207 | Propionic acid 4-(2,6-dioxo-1,3-dipropyl-2,3,6,7-tetrahydro-1H-purin-8-yl)-phenoxymethyl ester
TypeSmall organic molecule
Emp. Form.C21H26N4O5
Mol. Mass.414.4549
SMILESCCCn1c2nc([nH]c2c(=O)n(CCC)c1=O)-c1ccc(OCOC(=O)CC)cc1