Reaction Details
TargetNeutrophil elastase
LigandBDBM50025846
Substrate/Competitorn/a
Meas. Tech.ChEBML_218507
Ki 320000±n/a nM
Citation Groutas, WCAbrams, WRTheodorakis, MCKasper, AMRude, SABadger, RCOcain, TDMiller, KEMoi, MKBrubaker, MJ Amino acid derived latent isocyanates: irreversible inactivation of porcine pancreatic elastase and human leukocyte elastase. J Med Chem28:204-9 (1985) Neutrophil elastase
Name:Neutrophil elastase
Type:Enzyme
Mol. Mass.:28532.38
Organism:Homo sapiens (Human)
Description:P08246
Residue:267
BDBM50025846
NameBDBM50025846
Synonyms:2-[(Imidazole-1-carbonyl)-amino]-pentanoic acid methyl ester | CHEMBL306418
TypeSmall organic molecule
Emp. Form.C10H15N3O3
Mol. Mass.225.2444
SMILESCCC[C@H](NC(=O)n1ccnc1)C(=O)OC