Reaction Details
TargetNeutrophil elastase
LigandBDBM50024652
Substrate/Competitorn/a
Meas. Tech.ChEBML_63792
IC50 26800±n/a nM
Citation Groutas, WCStanga, MABrubaker, MJHuang, TLMoi, MKCarroll, RT Substituted 2-pyrones, 2-pyridones, and other congeners of elasnin as potential agents for the treatment of chronic obstructive lung diseases. J Med Chem28:1106-9 (1985) Neutrophil elastase
Name:Neutrophil elastase
Type:Enzyme
Mol. Mass.:28532.38
Organism:Homo sapiens (Human)
Description:P08246
Residue:267
BDBM50024652
NameBDBM50024652
Synonyms:3-Dodecanoyl-4-hydroxy-6-methyl-pyran-2-one | CHEMBL7839
TypeSmall organic molecule
Emp. Form.C18H28O4
Mol. Mass.308.4125
SMILESCCCCCCCCCCCC(=O)c1c(O)cc(C)oc1=O