Reaction Details
TargetNeutrophil elastase
LigandBDBM50025857
Substrate/Competitorn/a
Meas. Tech.ChEBML_63792
IC50 153000±n/a nM
Citation Groutas, WCStanga, MABrubaker, MJHuang, TLMoi, MKCarroll, RT Substituted 2-pyrones, 2-pyridones, and other congeners of elasnin as potential agents for the treatment of chronic obstructive lung diseases. J Med Chem28:1106-9 (1985) Neutrophil elastase
Name:Neutrophil elastase
Type:Enzyme
Mol. Mass.:28532.38
Organism:Homo sapiens (Human)
Description:P08246
Residue:267
BDBM50025857
NameBDBM50025857
Synonyms:4-Hydroxy-6-undecyl-1H-pyridin-2-one | CHEMBL13276
TypeSmall organic molecule
Emp. Form.C16H27NO2
Mol. Mass.265.3911
SMILESCCCCCCCCCCCc1cc(O)cc(=O)[nH]1