Reaction Details
TargetPepsin A
LigandBDBM50025889
Substrate/Competitorn/a
Meas. Tech.ChEBML_154011
Ki 1.5±n/a nM
Citation Rich, DH Pepstatin-derived inhibitors of aspartic proteinases. A close look at an apparent transition-state analogue inhibitor. J Med Chem28:263-73 (1985) Pepsin A
Name:Pepsin A
Type:Enzyme
Mol. Mass.:41232.87
Organism:Porcine
Description:n/a
Residue:385
BDBM50025889
NameBDBM50025889
Synonyms:3-Hydroxy-6-methyl-4-(methyl-{3-methyl-2-[3-methyl-2-(3-methyl-butyrylamino)-butyrylamino]-butyryl}-amino)-heptanoic acid [1-methyl-2-(4-methyl-pentanoylamino)-2-oxo-ethyl]-amide | CHEMBL120764
TypeSmall organic molecule
Emp. Form.C33H61N5O7
Mol. Mass.639.8667
SMILESCC(C)CCC(=O)NC(=O)[C@H](C)NC(=O)CC(O)[C@@H](CC(C)C)N(C)C(=O)[C@H](NC(=O)[C@@H](NC(=O)CC(C)C)C(C)C)C(C)C