Reaction Details
TargetPeroxisomal N(1)-acetyl-spermine/spermidine oxidase
LigandBDBM50026231
Substrate/Competitorn/a
Meas. Tech.ChEBML_159843
Ki 700±n/a nM
Citation Bey, PBolkenius, FNSeiler, NCasara, P N-2,3-Butadienyl-1,4-butanediamine derivatives: potent irreversible inactivators of mammalian polyamine oxidase. J Med Chem28:1-2 (1985) Peroxisomal N(1)-acetyl-spermine/spermidine oxidase
Name:Peroxisomal N(1)-acetyl-spermine/spermidine oxidase
Type:Enzyme
Mol. Mass.:70274.33
Organism:Homo sapiens (Human)
Description:Q6QHF9
Residue:649
BDBM50026231
NameBDBM50026231
Synonyms:CHEMBL59622 | N*1*-Buta-2,3-dienyl-butane-1,4-diamine
TypeSmall organic molecule
Emp. Form.C8H16N2
Mol. Mass.140.226
SMILESNCCCCNCC=C=C