Reaction Details
TargetPeroxisomal N(1)-acetyl-spermine/spermidine oxidase
LigandBDBM50026232
Substrate/Competitorn/a
Meas. Tech.ChEBML_159843
Ki 300±n/a nM
Citation Bey, PBolkenius, FNSeiler, NCasara, P N-2,3-Butadienyl-1,4-butanediamine derivatives: potent irreversible inactivators of mammalian polyamine oxidase. J Med Chem28:1-2 (1985) Peroxisomal N(1)-acetyl-spermine/spermidine oxidase
Name:Peroxisomal N(1)-acetyl-spermine/spermidine oxidase
Type:Enzyme
Mol. Mass.:70274.33
Organism:Homo sapiens (Human)
Description:Q6QHF9
Residue:649
BDBM50026232
NameBDBM50026232
Synonyms:CHEMBL293698 | N-Buta-2,3-dienyl-N'-methyl-butane-1,4-diamine
TypeSmall organic molecule
Emp. Form.C9H18N2
Mol. Mass.154.2526
SMILESCNCCCCNCC=C=C