Reaction Details
TargetDihydrofolate reductase
LigandBDBM50026394
Substrate/Competitorn/a
Meas. Tech.ChEBML_54600
Ki 35±n/a nM
Citation Piper, JRMcCaleb, GSMontgomery, JASchmid, FASirotnak, FM Syntheses and evaluation as antifolates of MTX analogues derived from 2, omega-diaminoalkanoic acids. J Med Chem28:1016-25 (1985) Dihydrofolate reductase
Name:Dihydrofolate reductase
Type:Enzyme
Mol. Mass.:21608.82
Organism:Mus musculus (Mouse)
Description:n/a
Residue:187
BDBM50026394
NameBDBM50026394
Synonyms:2-{4-[(2,4-Diamino-pteridin-6-ylmethyl)-methyl-amino]-benzoylamino}-3-ureido-propionic acid | CHEMBL414206
TypeSmall organic molecule
Emp. Form.C19H22N10O4
Mol. Mass.454.4426
SMILESCN(Cc1cnc2nc(N)nc(N)c2n1)c1ccc(cc1)C(=O)NC(CNC(N)=O)C(O)=O