Reaction Details
TargetDihydrofolate reductase
LigandBDBM50026399
Substrate/Competitorn/a
Meas. Tech.ChEBML_54600
Ki 0.00498±n/a nM
Citation Piper, JRMcCaleb, GSMontgomery, JASchmid, FASirotnak, FM Syntheses and evaluation as antifolates of MTX analogues derived from 2, omega-diaminoalkanoic acids. J Med Chem28:1016-25 (1985) Dihydrofolate reductase
Name:Dihydrofolate reductase
Type:Enzyme
Mol. Mass.:21608.82
Organism:Mus musculus (Mouse)
Description:n/a
Residue:187
BDBM50026399
NameBDBM50026399
Synonyms:3-(4-Chloro-benzoylamino)-2-{4-[(2,4-diamino-pteridin-6-ylmethyl)-methyl-amino]-benzoylamino}-propionic acid | CHEMBL267460
TypeSmall organic molecule
Emp. Form.C25H24ClN9O4
Mol. Mass.549.969
SMILESCN(Cc1cnc2nc(N)nc(N)c2n1)c1ccc(cc1)C(=O)NC(CNC(=O)c1ccc(Cl)cc1)C(O)=O