Reaction Details
TargetCholine O-acetyltransferase
LigandBDBM50026470
Substrate/Competitorn/a
Meas. Tech.ChEBML_27376
Ki 400000±n/a nM
Citation Cohen, SGChishti, SBElkind, JLReese, HCohen, JB Effects of charge, volume, and surface on binding of inhibitor and substrate moieties to acetylcholinesterase. J Med Chem28:1309-13 (1985) Choline O-acetyltransferase
Name:Choline O-acetyltransferase
Type:Enzyme Catalytic Domain
Mol. Mass.:71875.58
Organism:RAT
Description:Choline Acetyltransferase 0 RAT::P32738
Residue:640
BDBM50026470
NameBDBM50026470
Synonyms:(2-Hydroxy-ethyl)-dimethyl-sulfonium; iodide | CHEMBL25355
TypeSmall organic molecule
Emp. Form.C4H11IOS
Mol. Mass.234.099
SMILESCS(C)(I)CCO